Gradle BUILD FAILED 如何解決?
這篇部落格帶你解決Android Studio 3.0遇到的3種gradle編譯失敗的問題,然後給你一個解決gradle失敗的方法!
第1個
Error:(486) error: unknown element <intent-filter> found.
Error:(486) unknown element <intent-filter> found.
Error:java.util.concurrent.ExecutionException: java.util.concurrent.ExecutionException: com.android.tools.aapt2.Aapt2Exception: AAPT2 error : check logs for details
Error:java.util.concurrent.ExecutionException: com.android.tools.aapt2.Aapt2Exception: AAPT2 error: check logs for details
Error:com.android.tools.aapt2.Aapt2Exception: AAPT2 error: check logs for details
Error:Execution failed for task ':app:processC360YingyongbaoDebugResources'.
> Failed to execute aapt
解決辦法:專案gradle.properties裡面增加android.enableAapt2=false
這個時候編譯執行,就沒有錯誤了,但是如果沒有出現三角形執行的箭頭那麼就自己配置下
* 第二個*
Error:All flavors must now belong to a named flavor dimension. Learn more at https://d.android.com/r/tools/flavorDimensions-missing-error-message.html
解決辦法:新增類似紅色的程式碼即可(按照你的平臺名定義不必和我一樣)
第3個
在你打包簽名的時候會出現
Error:java.util.concurrent.ExecutionException: com.android.builder.internal.aapt.AaptException:
Error:Execution failed for task ':app:mergeC360YingyongbaoReleaseResources'.
> Error: java.util.concurrent.ExecutionException: com.android.builder.internal.aapt.AaptException:
其實所有的build failed都會給你提示資訊,你只需要根據錯誤的資訊然後去百度谷歌即可,以第3個錯誤為例:
雙擊”See complete output in console”進入Gradle Console介面,檢視報錯原因,第三個問題的error就是“AAPT err(Facade for 33422634): libpng error: Not a PNG file”
接下來我們百度這個問題如何解決:
按照部落格的指導即可完美找到答案,希望這種思路可以幫助大家輕鬆定位並解決問題~
相關推薦
Gradle BUILD FAILED 如何解決?
這篇部落格帶你解決Android Studio 3.0遇到的3種gradle編譯失敗的問題,然後給你一個解決gradle失敗的方法! 第1個 Error:(486) error: unknown element <intent-filte
Unity打包遇到CommandInvokationFailure: Gradle build failed.
環境:Untiy2017.3.1jdk:7.0報錯:CommandInvokationFailure: Gradle build failed. C:/Program Files/Java/jdk1.7.0_80\bin\java.exe -classpath "D:\Pro
【轉載】Android Gradle Build Error:Some file crunching failed, see logs for details解決辦法
mage erl 博客 details efault roi 成了 options 文件 錯誤日誌:Error:java.lang.RuntimeException: Some file crunching failed, see logs for details Lo
Gradle sync failed: Failed to find Build Tools revision 26.0.2的解決辦法
fail ger fin not in body andro nag tools clas 說明在android studio中沒有 build tools 的26.0.2的版本,你確認一下,是否是這樣; 點擊==》android studio的菜單欄中Tools==&g
android studio 更新 Gradle錯誤解決方法(Gradle sync failed)
app 是我 clear 聯網 建議 span 內容 roi file android studio 更新 Gradle錯誤解決方法 Android Studio每次更新版本都會更新Gradle這個插件,但由於長城的問題每次更新都是失敗,又是停止在Refre
androidstudio一直卡在gradle build進度的解決方法
gradle uil ids enc maxperm tof studio prop odi 打開項目的 gradle配置文件 gradle.properties 配置: org.gradle.jvmargs=-Xmx4096m -XX:MaxPermSize=1024
修改了SpringBoot的主類名稱後,gradle build報錯的解決辦法
ica app ida following images .com blog oot sin Unable to find a single main class from the following candidates [*.*Application] 修改了Sp
Mac android studio 一直卡在Gradle:Build Running的解決辦法
1.找到路徑/Users/michael/.gradle/wrapper/dists/gradle-4.1-all/bzyivzo6n839fup2jbap0tjew,在此資料夾下有一個gradle版本資料夾,開啟後是一個名字很長的資料夾,例如我的/Users/michael/.gradle/wrapper/
【已解決】上傳專案到binary 上面的時候報錯:FAILURE: Build failed with an exception.
zhangyinshandeMacBook-Pro:BaseLibs zhangyinshan$ ./gradlew install FAILURE: Build failed with an exception. * Where: Build file '/Users/zhangyinsh
Jenkins報錯'Gradle build daemon disappeared unexpectedly'的問題解決
在將專案整合到 Jenkins 後,經常會出現不穩定的構建,Jenkins 控制檯輸出的錯誤資訊為:Gradle build daemon disappeared unexpectedly (it may have been killed or may have crashed)。 經過調查,問題可能出在
Android Studio Gradle sync failed: Connection timed out: connect (解決辦法)
因為更新Android Studio到最新版,我採用下載最新版重新安裝的方式,遇到最大的問題就是Gradle sync failed: Connection timed out: connect ,在網上嘗試了各種辦法都得不到解決,這裡記錄下大佬教我
解決Android Studio Gradle Build Running 特別慢的問題
今天收到一封MAIL,是轉發了N次轉發過來的,標題就叫“FW: ^_^聽說是真有此事”,內容如下(我是不信的,至於你怎麼看,就看你的行動了。不過,真的有趣,讓我想起了以前的關於將IC卡放到微波爐里加熱的事件了,兩者很相似。):我在www.123de6.cn上看到了相關的資料(有
Gradle build報錯 Please correct the above warnings first解決方案
你也可以檢視我的其他同類文章,也會讓你有一定的收貨問題描述:在編譯的時候,出現了下面的錯誤提示Warning: there were 2 unresolved references to library class members. You proba
tomcat-redis-session-manager gradle build 遇到錯誤及解決方案
tomcat 整合redis 達到session 共享 1、網上很多資料都有提示如何構建,例如可參考:http://blog.csdn.net/xundh/article/details/51563609 當然可參考其他網址資料,我看了大部分都是差不多的。(在gradle build前先安裝
使用vue時Module build failed: TypeError: this._init is not a function錯誤的解決方法
錯誤描述 整個專案目錄結構如下: src hello.vue main.js index.html package.json webpack.config.js package.json { "name": "test-typeof-vue",
vue報錯Module build failed: Error: No parser and no file path given, couldn't infer a parser.解決辦法
今天中午更新的專案,vue模組裡子模組報錯 百度查詢 今天下午1點多吧 貌似git 新版本給解決了 只需一步 更新即可 npm i [email protected]~1.12.0 這個是降版本 因為是更新成1.13.0崩的 不過官網
vue報錯Module build failed: Error: No parser and no file path given, couldn't infer a parser.解決辦法
今天中午更新的專案,vue模組裡子模組報錯百度查詢 今天下午1點多吧 貌似git 新版本給解決了 只需一步 更新即可npm i [email protected]~1.12.0 這個是降版本 因為是更新成1.13.0崩的 不過官網更新了 1.13
Gradle sync failed: Could not find com.android.tools.build:gradle:2.3.3.
問題:Gradle編譯失敗 詳細錯誤訊息: Gradle sync failed: Could not find com.android.tools.build:gradle:2.3.3.
gradle build報錯解決方案
今天在匯入butterknife的時候莫名其妙報錯誤,清單檔案錯誤,好不容易看大神搞定,然而原理並不清楚,待以後一併處理原理,先將問題記錄 Error:Execution failed for task ':app:processArmDebugManifes
Android Studio開發 -- BUILD FAILED -- R檔案丟失 解決方案
Android Studio開發 -- BUILD FAILED -- R檔案丟失 解決方案 原來直接複製進來的圖片格式是jpg ,需要轉成 png ,後重新編譯就可以了 R檔案丟失!!!我最開心的就是遇見這個了,因為我寫過關於R檔案丟失問題解決方案彙總,怎麼也難不住我吧,